cis-octahydronaphthalene-2(1H)-one

Condensed phase thermochemistry data

Data compiled by: Hussein Y. Afeefy, Joel F. Liebman, and Stephen E. Stein

Quantity Value Units Method Reference Comment
Δcliquid-5867.2kJ/molCcbHuckel and Mentzel, 1926Corresponding Δfliquid = -354. kJ/mol (simple calculation by NIST; no Washburn corrections)
Δcliquid-5862.7 ± 4.5kJ/molCcbRoth and Lasse, 1925Corresponding Δfliquid = -359.1 kJ/mol (simple calculation by NIST; no Washburn corrections)

References

Huckel and Mentzel, 1926
Huckel, W.; Mentzel, R., Zur Stereochemie bicyclischer Ringsteme II. Die Stereoisomerie des Dekahydronaphtalins und seiner Derivate II. Stereoisomere β-substituierte Dekaline, Ann., 1926, 451, 109-132. [all data]

Roth and Lasse, 1925
Roth, W.A.; Lasse, R., Verbrennungswarme der Dekahydro-naphthaline und der Dekalone, Ann., 1925, 441, 48-53. [all data]