Cyclohexene,4-methoxy-

Gas phase ion energetics data

Data compiled by: Sharon G. Lias, Rhoda D. Levin, and Sherif A. Kafafi

Ionization energy determinations

IE (eV) Method Reference Comment
9.01 ± 0.03PENeijzen, Schmitz, et al., 1975Vertical value

References

Neijzen, Schmitz, et al., 1975
Neijzen, B.J.M.; Schmitz, R.F.; Klumpp, G.W.; DeLange, C.A., n- π Interactions in homoallylic methyl ethers. A photoelectron spectroscopic study, Tetrahedron, 1975, 31, 873. [all data]