1,1,4,4-Tetramethylcyclododec-8-yne

Reaction thermochemistry data

Data compiled by: Hussein Y. Afeefy, Joel F. Liebman, and Stephen E. Stein

Individual Reactions

2Hydrogen + 1,1,4,4-Tetramethylcyclododec-8-yne = Cyclododecane, 1,1,4,4-tetramethyl-

By formula: 2H2 + C16H28 = C16H32

Quantity Value Units Method Reference Comment
Δr-256.kJ/molChydSicher, Svoboda, et al., 1968liquid phase; solvent: Acetic acid

References

Sicher, Svoboda, et al., 1968
Sicher, J.; Svoboda, M.; Mallon, B.J.; Turner, R.B., Stereochemical studies. Part XLVII. Conformational analysis of many-membered ring compounds. The cyclododecenes, J. Chem. Soc. B, 1968, 441-447. [all data]