1,3-Propanediol, 2-phenyl-

Phase change data

Data compiled by: Thermodynamics Research Center, NIST Boulder Laboratories, Chris Muzny director

Quantity Value Units Method Reference Comment
Tfus321.9KN/AAdkins and Billica, 1948Uncertainty assigned by TRC = 1. K

In addition to the Thermodynamics Research Center (TRC) data available from this site, much more physical and chemical property data is available from the following TRC products:

References

Adkins and Billica, 1948
Adkins, H.; Billica, H.R., The Hydrogenation of Esters to Alcohols at 15 - 150 deg, J. Am. Chem. Soc., 1948, 70, 3121-5. [all data]