Nickel[II] bis(O,O'-diethyldithiophosphate)

Gas phase ion energetics data

Data compiled by: Sharon G. Lias and Joel F. Liebman

Ionization energy determinations

IE (eV) Method Reference Comment
6.9PECiliberto, Di Bella, et al., 1990
7.20PECiliberto, Di Bella, et al., 1990Vertical value

References

Ciliberto, Di Bella, et al., 1990
Ciliberto, E.; Di Bella, S.; Fragala, I., Electronic structures of transition-metal four-cooridinated complexes. Part 3. Theoretical AB initio and ultraviolet photoelectron spectroscopy study of nickel(II). Palladium(II), and platinum(II) bis (O,O-diethyl dithiophosphate) square-planar complexes, J. Chem. Soc. Dalton Trans., 1990, 849. [all data]