Zinc(II) bis(N,N-dipropyldithiocarbamate)

Phase change data

Data compiled by: William E. Acree, Jr., James S. Chickos

Quantity Value Units Method Reference Comment
Δsub147. ± 2.kJ/molDSC,Ede Carvalho, Airoldi, et al., 1992

References

de Carvalho, Airoldi, et al., 1992
de Carvalho, Maria A.R.P.; Airoldi, Claudio; de Souza, Antonio G., Thermochemical features of di-n-propyldithiocabamate chelates of zinc-group elements, J. Chem. Soc., Dalton Trans., 1992, 7, 1235, https://doi.org/10.1039/dt9920001235 . [all data]