Diazene, bis(4-methoxyphenyl)-, 1-oxide

Condensed phase thermochemistry data

Data compiled as indicated in comments:
DH - Eugene S. Domalski and Elizabeth D. Hearing
ALS - Hussein Y. Afeefy, Joel F. Liebman, and Stephen E. Stein

Quantity Value Units Method Reference Comment
Δfsolid-101.4 ± 2.6kJ/molCcbAcree, Tucker, et al., 1993ALS
Quantity Value Units Method Reference Comment
Δcsolid-7408.6 ± 1.9kJ/molCcbAcree, Tucker, et al., 1993ALS

Constant pressure heat capacity of liquid

Cp,liquid (J/mol*K) Temperature (K) Reference Comment
569.400.Kreutzer, 1938Value a few degrees below anisotropic-isotropic liquid-liquid transition at 409 K.; DH

Constant pressure heat capacity of solid

Cp,solid (J/mol*K) Temperature (K) Reference Comment
380.3368.Barral, Porter, et al., 1967T = 368 to 423 K.; DH

References

Acree, Tucker, et al., 1993
Acree, W.E., Jr.; Tucker, S.A.; Pilcher, G.; Paz Andrade, M.I.; Ribeiro da Silva, M.D.M.C., Enthalpies of combustion of p-azoxyanisole p-azoxyphenetole: the dissociation enthalpy of the N-O bonds. Enthalpies of crystal-to-(liquid crystal) transitions, J. Chem. Thermodyn., 1993, 25, 653-659. [all data]

Kreutzer, 1938
Kreutzer, C., Kalorimetrische Messungen beim Übergang von der anisotropen zur isotropen flüssigen Phase, Ann. Physik. [5]33, 1938, 192-209. [all data]

Barral, Porter, et al., 1967
Barral, E.M., II; Porter, R.S.; Johnson, J.F., Specific heats of nematic, smectic, and cholesteric liquid crystals by differential scanning calorimetry, J. Phys. Chem., 1967, 71, 895-900. [all data]