Hexadecane, 2-methyl-

Phase change data

Data compiled as indicated in comments:
TRC - Thermodynamics Research Center, NIST Boulder Laboratories, Chris Muzny director
AC - William E. Acree, Jr., James S. Chickos

Quantity Value Units Method Reference Comment
Tfus278.1KN/ATerres, Gebert, et al., 1954Uncertainty assigned by TRC = 6. K; TRC

Enthalpy of vaporization

ΔvapH (kJ/mol) Temperature (K) Method Reference Comment
63.5443.AStephenson and Malanowski, 1987Based on data from 428. - 569. K. See also Terres, Brinkmann, et al., 1959.; AC

In addition to the Thermodynamics Research Center (TRC) data available from this site, much more physical and chemical property data is available from the following TRC products:

Kovats' RI, non-polar column, isothermal

Data compiled by: NIST Mass Spectrometry Data Center, William E. Wallace, director

Column type CapillaryCapillaryCapillary
Active phase OV-101Apiezon LSE-52
Column length (m) 22.20.40.
Carrier gas  HeHe
Substrate
Column diameter (mm) 0.30.30.3
Phase thickness (μm)
Temperature (C) 180.180.180.
I 1665.1660.61663.8
ReferenceKusmierz, Malinski, et al., 1985Kusmierz, Malinski, et al., 1985Kusmierz, Malinski, et al., 1985
Comment MSDC-RI MSDC-RI MSDC-RI

Van Den Dool and Kratz RI, polar column, temperature ramp

Data compiled by: NIST Mass Spectrometry Data Center, William E. Wallace, director

Column type Capillary
Active phase Supelcowax-10
Column length (m) 30.
Carrier gas He
Substrate
Column diameter (mm) 0.25
Phase thickness (μm) 0.25
Tstart (C) 50.
Tend (C) 230.
Heat rate (K/min) 3.
Initial hold (min)
Final hold (min) 30.
I 1654.
ReferenceMoreira, Trugo, et al., 2002
Comment MSDC-RI

References

Terres, Gebert, et al., 1954
Terres, E.; Gebert, F.; Fischer, D.; Modak, G., Brennst.-Chem., 1954, 35, 263-9. [all data]

Stephenson and Malanowski, 1987
Stephenson, Richard M.; Malanowski, Stanislaw, Handbook of the Thermodynamics of Organic Compounds, 1987, https://doi.org/10.1007/978-94-009-3173-2 . [all data]

Terres, Brinkmann, et al., 1959
Terres, E.; Brinkmann, L.; Fischer, D.; Hüllstrung, D.; Loz, W.; Weisbrod, G., Brennst.-Chem., 1959, 40, 279. [all data]