1H-Pyrrole, 3-ethyl-

Van Den Dool and Kratz RI, polar column, temperature ramp

Data compiled by: NIST Mass Spectrometry Data Center, William E. Wallace, director

Column type CapillaryCapillary
Active phase CP-Wax 52CBCP-Wax 52CB
Column length (m) 50.50.
Carrier gas
Substrate
Column diameter (mm) 0.320.32
Phase thickness (μm)
Tstart (C) 60.60.
Tend (C) 220.220.
Heat rate (K/min) 4.4.
Initial hold (min) 5.5.
Final hold (min) 30.30.
I 1617.1657.
ReferenceMahadevan and Farmer, 2006Mahadevan and Farmer, 2006
Comment MSDC-RI MSDC-RI

References

Mahadevan and Farmer, 2006
Mahadevan, K.; Farmer, L., Key Odor Impact Compounds in Three Yeast Extract Pastes, J. Agric. Food Chem., 2006, 54, 19, 7242-7250, https://doi.org/10.1021/jf061102x . [all data]