(E) Phenyl-1-propenylsulfide

Reaction thermochemistry data

Data compiled by: Hussein Y. Afeefy, Joel F. Liebman, and Stephen E. Stein

Individual Reactions

Allylphenyl sulfide = (E) Phenyl-1-propenylsulfide

By formula: C9H10S = C9H10S

Quantity Value Units Method Reference Comment
Δr-10.8 ± 0.6kJ/molEqkKimmelma, 1988liquid phase; solvent: DMSO; NMR

(E) Phenyl-1-propenylsulfide = Benzene, (1-propenylthio)-, (Z)-

By formula: C9H10S = C9H10S

Quantity Value Units Method Reference Comment
Δr-0.3 ± 0.1kJ/molEqkVirtanen, 1986liquid phase; solvent: THF; NMR

References

Kimmelma, 1988
Kimmelma, R., Structure-stability relationships in vinyl sulfides. III. Stabilization caused by different alkylthio and phenylthio groups attached to an olefinic double bond, Acta Chem. Scand., 1988, 42, 550-555. [all data]

Virtanen, 1986
Virtanen, R., Structure-stability relationships in vinyl sulfides. I. On the stable conformations of vinyl sulfides, Acta Chem. Scand., 1986, 40, 313-327. [all data]