Acetamide, N-(2-methylpropyl)-

Condensed phase thermochemistry data

Data compiled by: Eugene S. Domalski and Elizabeth D. Hearing

Constant pressure heat capacity of solid

Cp,solid (J/mol*K) Temperature (K) Reference
190.298.15Konicek and Wadso, 1971

References

Konicek and Wadso, 1971
Konicek, J.; Wadso, I., Thermochemical properties of some carboxylic acids, amines and N-substituted amides in aqueous solution, Acta Chem. Scand., 1971, 25, 1541-1551. [all data]