1,3-Di-tert-butyl-1,3,2-diazasilol-2-ylidene

Gas phase ion energetics data

Data compiled by: Sharon G. Lias and Joel F. Liebman

Ionization energy determinations

IE (eV) Method Reference Comment
6.7PEArduengo, Bock, et al., 1994
6.96PEArduengo, Bock, et al., 1994Vertical value

References

Arduengo, Bock, et al., 1994
Arduengo, A.J.; Bock, H.; Chen, H.; Denk, M.; Dixon, D.A.; Green, J.C.; Herrmann, W.A.; Jones, N.L.; Wagner, M.; West, R., Photoelectron spectroscopy of a carbene/silylene/germylene series, J. Am. Chem. Soc., 1994, 116, 6641. [all data]