Mercury bromide

Condensed phase thermochemistry data

Quantity Value Units Method Reference Comment
Δfsolid-204.18kJ/molReviewChase, 1998Data last reviewed in March, 1962
Quantity Value Units Method Reference Comment
solid218.73J/mol*KReviewChase, 1998Data last reviewed in March, 1962

Solid Phase Heat Capacity (Shomate Equation)

Cp° = A + B*t + C*t2 + D*t3 + E/t2
H° − H°298.15= A*t + B*t2/2 + C*t3/3 + D*t4/4 − E/t + F − H
S° = A*ln(t) + B*t + C*t2/2 + D*t3/3 − E/(2*t2) + G
    Cp = heat capacity (J/mol*K)
    H° = standard enthalpy (kJ/mol)
    S° = standard entropy (J/mol*K)
    t = temperature (K) / 1000.

View plot Requires a JavaScript / HTML 5 canvas capable browser.

View table.

Temperature (K) 298. - 1500.
A 97.56837
B 49.05405
C -34.19504
D 9.545587
E -0.428220
F -236.6127
G 321.2011
H -204.1792
ReferenceChase, 1998
Comment Data last reviewed in March, 1962

References

Chase, 1998
Chase, M.W., Jr., NIST-JANAF Themochemical Tables, Fourth Edition, J. Phys. Chem. Ref. Data, Monograph 9, 1998, 1-1951. [all data]