9,9'-Dimethyl-9,9'-bifluorenyl

Phase change data

Data compiled as indicated in comments:
AC - William E. Acree, Jr., James S. Chickos
ALS - Hussein Y. Afeefy, Joel F. Liebman, and Stephen E. Stein

Quantity Value Units Method Reference Comment
Δsub119.74kJ/molVRakus, Verevkin, et al., 1994crystal phase; ALS
Δsub119.7 ± 1.3kJ/molTRakus, Verevkin, et al., 1994Based on data from 368. - 403. K.; AC

Enthalpy of vaporization

ΔvapH (kJ/mol) Temperature (K) Method Reference Comment
94.6368. - 403.BRakus, Verevkin, et al., 1994AC

Enthalpy of sublimation

ΔsubH (kJ/mol) Temperature (K) Method Reference Comment
118.7 ± 1.3386.TRakus, Verevkin, et al., 1994Based on data from 368. - 403. K.; AC

Gas phase thermochemistry data

Data compiled by: Hussein Y. Afeefy, Joel F. Liebman, and Stephen E. Stein

Quantity Value Units Method Reference Comment
Δfgas77.41 ± 0.58kcal/molCcrRakus, Verevkin, et al., 1994

Condensed phase thermochemistry data

Data compiled by: Hussein Y. Afeefy, Joel F. Liebman, and Stephen E. Stein

Quantity Value Units Method Reference Comment
Δfsolid48.81 ± 0.48kcal/molCcrRakus, Verevkin, et al., 1994crystal phase
Quantity Value Units Method Reference Comment
Δcsolid-3433.731 ± 0.098kcal/molCcrRakus, Verevkin, et al., 1994crystal phase; Corresponding Δfsolid = 48.834 kcal/mol (simple calculation by NIST; no Washburn corrections)

References

Rakus, Verevkin, et al., 1994
Rakus, K.; Verevkin, S.P.; Schatzer, J.; Beckhaus, H.-D.; Ruchardt, C., Thermochemistry and thermal decomposition of 9,9'-bifluorenyl and 9,9'-dimethyl-9,9'-bifluorenyl - the stabilization energy of 9-fluorenyl radicals, Chem. Ber., 1994, 127, 1095-1103. [all data]