2-(2-Phenylvinyl)pyridine, cis

Gas phase ion energetics data

Data compiled as indicated in comments:
LLK - Sharon G. Lias, Rhoda D. Levin, and Sherif A. Kafafi

Ionization energy determinations

IE (eV) Method Reference Comment
8.15EIGrutzmacher, Schaldach, et al., 1980LLK

Appearance energy determinations

Ion AE (eV) Other Products MethodReferenceComment
C13H10N+9.0HEIGrutzmacher, Schaldach, et al., 1980LLK

Phase change data

Data compiled by: Robert L. Brown and Stephen E. Stein

Reduced pressure boiling point

Tboil (K) Pressure (atm) Reference
414.20.013Weast and Grasselli, 1989

References

Grutzmacher, Schaldach, et al., 1980
Grutzmacher, H.-F.; Schaldach, B.; Schubert, R.; Ramana, D.V., Ion kinetic energy release as a transition state probe in intramolecular aromatic substitutions, Adv. Mass Spectrom., 1980, 8, 795. [all data]