2,5-Dinitrofluorene

Lee's RI, non-polar column, temperature ramp

Data compiled by: NIST Mass Spectrometry Data Center, William E. Wallace, director

Column type Capillary
Active phase SE-52
Column length (m) 30.
Carrier gas He
Substrate
Column diameter (mm) 0.3
Phase thickness (μm) 0.25
Tstart (C) 25.
Tend (C) 295.
Heat rate (K/min) 4.
Initial hold (min)
Final hold (min)
I 430.32
ReferenceWhite, Robbat, et al., 1983
Comment MSDC-RI

References

White, Robbat, et al., 1983
White, C.M.; Robbat, A., Jr.; Hoes, R.M., Gas chromatographic retention characteristics of nitrated polycyclic aromatic hydrocarbons on SE-52, Chromatographia, 1983, 17, 11, 605-612, https://doi.org/10.1007/BF02261944 . [all data]