Methyl 7,12-dihydroxy-3-oxocholan-24-oate, (5β,7α,12α)-, 2TMS derivative

Normal alkane RI, non-polar column, custom temperature program

Data compiled by: NIST Mass Spectrometry Data Center, William E. Wallace, director

Column type Capillary
Active phase Ultra-1
Column length (m) 25.
Carrier gas H2
Substrate
Column diameter (mm) 0.32
Phase thickness (μm) 0.17
Program 50 0C (3 min) -> 185 0C 5 K/min -> 280 0C
I 3300.
ReferenceAxelson, Ellis, et al., 2000
Comment MSDC-RI

References

Axelson, Ellis, et al., 2000
Axelson, M.; Ellis, E.; Mörk, B.; Garmark, K.; Abrahamsson, A.; Björkhem, I.; Ericzon, B.-G.; Einarsson, C., Bile acid synthesis in cultured human hepatocytes: support for an alternative biosynthetic pathway to cholic acid, Hepatology, 2000, 31, 6, 1305-1312, https://doi.org/10.1053/jhep.2000.7877 . [all data]