3-Phenyl-2-propyn-1-ol

Condensed phase thermochemistry data

Data compiled as indicated in comments:
DRB - Donald R. Burgess, Jr.
ALS - Hussein Y. Afeefy, Joel F. Liebman, and Stephen E. Stein

Quantity Value Units Method Reference Comment
Δfliquid79.8 ± 4.0kJ/molCcbN/Arecalculated with modern CO2,H2O thermo; estimated uncertainty (NOTE all values in source also have wrong sign); DRB
Δfliquid-49.8kJ/molCcbMoureu and Andre, 1914ALS
Quantity Value Units Method Reference Comment
Δcliquid-4764.7kJ/molCcbMoureu and Andre, 1914Corresponding Δfliquid = 79.9 kJ/mol (simple calculation by NIST; no Washburn corrections); ALS

References

Moureu and Andre, 1914
Moureu, C.; Andre, E., Thermochimie des composes acetyleniques, Ann. Chim. Phys., 1914, 1, 113-145. [all data]