1-Adamantanecarboxamide, N,N-dimethyl-,

Gas phase thermochemistry data

Data compiled by: Hussein Y. Afeefy, Joel F. Liebman, and Stephen E. Stein

Quantity Value Units Method Reference Comment
Δfgas-286.1 ± 2.7kJ/molCcbAbboud, Jimenez, et al., 1995Author was aware that data differs from previously reported values; See 93ABB/JIM

References

Abboud, Jimenez, et al., 1995
Abboud, J.-L.M.; Jimenez, P.; Roux, M.V.; Turrion, C.; Lopez-Mardomingo, C.; Podosenin, A.; Rogers, D.W.; Liebman, J.F., Interrelations of the energetics of amides and alkenes: enthalpies of formation of N,N-dimethyl dertivatives of pivalamide, 1-adamantylcarboxamide and benzamide, and of styrene and its a-, trans-β- and β,β-methylated derivates, J. Phys. Org. Chem., 1995, 8, 15-25. [all data]