marmin

Normal alkane RI, non-polar column, temperature ramp

View large format table.

Column type Active phase I Reference Comment
CapillaryDB-52985.Feger, Brandauer, et al., 200615. m/0.25 mm/0.5 μm, He, 50. C @ 1. min, 10. K/min, 320. C @ 5. min

References

Feger, Brandauer, et al., 2006
Feger, W.; Brandauer, H.; Gabris, P.; Ziegler, H., Nonvolatiles of Commercial Lime and Grapefruit Oils Separated by High-Speed Countercurrent Chromatography, J. Agric. Food Chem., 2006, 54, 6, 2242-2252, https://doi.org/10.1021/jf052267t . [all data]