Iron, tricarbonylbis(trimethyl phosphite-P)-

Gas phase ion energetics data

Data compiled by: Henry M. Rosenstock, Keith Draxl, Bruce W. Steiner, and John T. Herron

Ionization energy determinations

IE (eV) Method Reference
7.33EIInnorta, Distefano, et al., 1968

References

Innorta, Distefano, et al., 1968
Innorta, G.; Distefano, G.; Pignataro, S., Equivalent orbital calculations of the ionization energies of zero valent transition-metal complexes, Intern. J. Mass Spectrom. Ion Phys., 1968, 1, 435. [all data]