2-Nonanol, acetate

Normal alkane RI, non-polar column, temperature ramp

Data compiled by: NIST Mass Spectrometry Data Center, William E. Wallace, director

Column type CapillaryCapillaryCapillary
Active phase ZB-1ZB-1SE-30
Column length (m) 30.30.10.
Carrier gas NitrogenN2
Substrate
Column diameter (mm) 0.250.250.25
Phase thickness (μm) 0.250.25
Tstart (C) 45.45.20.
Tend (C) 230.230.200.
Heat rate (K/min) 3.3.4.
Initial hold (min)
Final hold (min)
I 1221.1221.1219.
ReferenceMierendorff, Stahl-Biskup, et al., 2008Mierendorff, Stahl-Biskup, et al., 2003Yaacob, Abdullah, et al., 1989
Comment MSDC-RI MSDC-RI MSDC-RI

Van Den Dool and Kratz RI, polar column, temperature ramp

Data compiled by: NIST Mass Spectrometry Data Center, William E. Wallace, director

Column type Capillary
Active phase Carbowax 20M
Column length (m) 60.
Carrier gas He
Substrate
Column diameter (mm) 0.32
Phase thickness (μm)
Tstart (C) 50.
Tend (C) 225.
Heat rate (K/min) 1.5
Initial hold (min)
Final hold (min) 80.
I 1452.
ReferenceChen and Ho, 1988
Comment MSDC-RI

References

Mierendorff, Stahl-Biskup, et al., 2008
Mierendorff, H.-G.; Stahl-Biskup, E.; Posthumus, M.A.; van Beek, T.A., Composition of commercial Cape chamomile oil (Eriocephalus punctuatus / Eriocephalus tenuifolius), 2008, retrieved from http://www.chemische-analysen-hamburg.de/Publikationen?CapeChamomileOil/. [all data]

Mierendorff, Stahl-Biskup, et al., 2003
Mierendorff, H.-G.; Stahl-Biskup, E.; Posthumus, M.A.; van Beek, T.A., Composition of commercial Cape chamomile oil (Eriocephalus punctulatus), Flavour Fragr. J., 2003, 18, 6, 510-514, https://doi.org/10.1002/ffj.1259 . [all data]

Yaacob, Abdullah, et al., 1989
Yaacob, K.B.; Abdullah, C.M.; Joulain, D., Essential Oil of Ruta graveolens L., J. Essent. Oil Res., 1989, 1, 5, 203-207, https://doi.org/10.1080/10412905.1989.9697787 . [all data]