Disiloxane, 1,1,3-trimethyl-1,3,3-triphenyl-

Phase change data

Data compiled by: William E. Acree, Jr., James S. Chickos

Enthalpy of vaporization

ΔvapH (kJ/mol) Temperature (K) Method Reference Comment
80.509.AStephenson and Malanowski, 1987Based on data from 494. - 624. K.
64.4560.N/ADitsent, Skorokhodov, et al., 1974Based on data from 495. - 624. K.

References

Stephenson and Malanowski, 1987
Stephenson, Richard M.; Malanowski, Stanislaw, Handbook of the Thermodynamics of Organic Compounds, 1987, https://doi.org/10.1007/978-94-009-3173-2 . [all data]

Ditsent, Skorokhodov, et al., 1974
Ditsent, V.E.; Skorokhodov, I.I.; Terent'eva, N.A.; Zolotareva, M.N., Russ. J. Phys. Chem., 1974, 48, 447. [all data]