9H-Carbazole, 9-butyl-

Phase change data

Data compiled by: Thermodynamics Research Center, NIST Boulder Laboratories, Chris Muzny director

Quantity Value Units Method Reference Comment
Tfus331.KN/ALopatinskii, Sirotkina, et al., 1964Uncertainty assigned by TRC = 4. K

In addition to the Thermodynamics Research Center (TRC) data available from this site, much more physical and chemical property data is available from the following TRC products:

Kovats' RI, non-polar column, isothermal

View large format table.

Column type Active phase Temperature (C) I Reference Comment
PackedSE-30190.2024.Tibor and Anna, 1971N2, Chromosorb W-AW; Column length: 2. m

Kovats' RI, polar column, isothermal

View large format table.

Column type Active phase Temperature (C) I Reference Comment
PackedPEG-20M170.2834.Tibor and Anna, 1971N2, Chromosorb W-AW; Column length: 2. m
PackedPEG-20M190.2884.Tibor and Anna, 1971N2, Chromosorb W-AW; Column length: 2. m

References

Lopatinskii, Sirotkina, et al., 1964
Lopatinskii, V.P.; Sirotkina, E.E.; Sukhoroslava, M.M., N-Alkylcarbazoles, Metody Poluch. Khim. Reak. Prep., 1964, 1964, No. 11, 69-72. [all data]