Benzene, 1,1',1'',1'''-(1,4-butanediylidene)tetrakis-

Condensed phase thermochemistry data

Data compiled by: Hussein Y. Afeefy, Joel F. Liebman, and Stephen E. Stein

Quantity Value Units Method Reference Comment
Δcsolid-3560.54 ± 0.96kcal/molCcbCoops, Hoijtink, et al., 1953Reanalyzed by Cox and Pilcher, 1970, Original value = -3560.2 ± 1. kcal/mol; Corresponding Δfsolid = 39.013 kcal/mol (simple calculation by NIST; no Washburn corrections)

References

Coops, Hoijtink, et al., 1953
Coops, J.; Hoijtink, G.J.; Kramer, TH.J.E., Thermochemical investigations on arylethanes. II. Heats of combustion of some para and ortho tolylthanes and phenylbutanes., Rec. Trav. Chim. Pays/Bas, 1953, 72, 793. [all data]

Cox and Pilcher, 1970
Cox, J.D.; Pilcher, G., Thermochemistry of Organic and Organometallic Compounds, Academic Press, New York, 1970, 1-636. [all data]