Argon cation

Gas phase thermochemistry data

Quantity Value Units Method Reference Comment
gas,1 bar166.40J/mol*KReviewChase, 1998Data last reviewed in March, 1982

Reaction thermochemistry data

Data compiled by: Michael M. Meot-Ner (Mautner) and Sharon G. Lias

Individual Reactions

Ar+ + Argon = (Ar+ • Argon)

By formula: Ar+ + Ar = (Ar+ • Ar)

Quantity Value Units Method Reference Comment
Δr20. ± 20.kcal/molAVGN/AAverage of 5 out of 7 values; Individual data points
Quantity Value Units Method Reference Comment
Δr12.8cal/mol*KPHPMSTeng and Conway, 1973gas phase; switching reaction(N2+)Ar; Turner and Conway, 1979, Liu and Conway, 1975

(Ar+ • 2Argon) + Argon = (Ar+ • 3Argon)

By formula: (Ar+ • 2Ar) + Ar = (Ar+ • 3Ar)

Quantity Value Units Method Reference Comment
Δr4.9 ± 0.3kcal/molPHPMSHiraoka and Mori, 1989gas phase
Quantity Value Units Method Reference Comment
Δr17.3cal/mol*KPHPMSHiraoka and Mori, 1989gas phase

Free energy of reaction

ΔrG° (kcal/mol) T (K) Method Reference Comment
2.077.PHPMSTeng and Conway, 1973gas phase

(Ar+ • Argon) + Argon = (Ar+ • 2Argon)

By formula: (Ar+ • Ar) + Ar = (Ar+ • 2Ar)

Quantity Value Units Method Reference Comment
Δr5.06 ± 0.08kcal/molPHPMSTurner and Conway, 1979gas phase
Quantity Value Units Method Reference Comment
Δr20.3cal/mol*KPHPMSTurner and Conway, 1979gas phase

(Ar+ • 10Argon) + Argon = (Ar+ • 11Argon)

By formula: (Ar+ • 10Ar) + Ar = (Ar+ • 11Ar)

Quantity Value Units Method Reference Comment
Δr1.6 ± 0.2kcal/molPHPMSHiraoka and Mori, 1989gas phase
Quantity Value Units Method Reference Comment
Δr17.4cal/mol*KPHPMSHiraoka and Mori, 1989gas phase

(Ar+ • 9Argon) + Argon = (Ar+ • 10Argon)

By formula: (Ar+ • 9Ar) + Ar = (Ar+ • 10Ar)

Quantity Value Units Method Reference Comment
Δr1.55 ± 0.20kcal/molPHPMSHiraoka and Mori, 1989gas phase
Quantity Value Units Method Reference Comment
Δr17.1cal/mol*KPHPMSHiraoka and Mori, 1989gas phase

(Ar+ • 3Argon) + Argon = (Ar+ • 4Argon)

By formula: (Ar+ • 3Ar) + Ar = (Ar+ • 4Ar)

Quantity Value Units Method Reference Comment
Δr1.7 ± 0.2kcal/molPHPMSHiraoka and Mori, 1989gas phase
Quantity Value Units Method Reference Comment
Δr13.9cal/mol*KPHPMSHiraoka and Mori, 1989gas phase

(Ar+ • 4Argon) + Argon = (Ar+ • 5Argon)

By formula: (Ar+ • 4Ar) + Ar = (Ar+ • 5Ar)

Quantity Value Units Method Reference Comment
Δr1.6 ± 0.2kcal/molPHPMSHiraoka and Mori, 1989gas phase
Quantity Value Units Method Reference Comment
Δr16.1cal/mol*KPHPMSHiraoka and Mori, 1989gas phase

(Ar+ • 5Argon) + Argon = (Ar+ • 6Argon)

By formula: (Ar+ • 5Ar) + Ar = (Ar+ • 6Ar)

Quantity Value Units Method Reference Comment
Δr1.6 ± 0.2kcal/molPHPMSHiraoka and Mori, 1989gas phase
Quantity Value Units Method Reference Comment
Δr17.0cal/mol*KPHPMSHiraoka and Mori, 1989gas phase

(Ar+ • 6Argon) + Argon = (Ar+ • 7Argon)

By formula: (Ar+ • 6Ar) + Ar = (Ar+ • 7Ar)

Quantity Value Units Method Reference Comment
Δr1.6 ± 0.2kcal/molPHPMSHiraoka and Mori, 1989gas phase
Quantity Value Units Method Reference Comment
Δr17.4cal/mol*KPHPMSHiraoka and Mori, 1989gas phase

(Ar+ • 7Argon) + Argon = (Ar+ • 8Argon)

By formula: (Ar+ • 7Ar) + Ar = (Ar+ • 8Ar)

Quantity Value Units Method Reference Comment
Δr1.6 ± 0.2kcal/molPHPMSHiraoka and Mori, 1989gas phase
Quantity Value Units Method Reference Comment
Δr17.4cal/mol*KPHPMSHiraoka and Mori, 1989gas phase

(Ar+ • 8Argon) + Argon = (Ar+ • 9Argon)

By formula: (Ar+ • 8Ar) + Ar = (Ar+ • 9Ar)

Quantity Value Units Method Reference Comment
Δr1.6 ± 0.2kcal/molPHPMSHiraoka and Mori, 1989gas phase
Quantity Value Units Method Reference Comment
Δr17.3cal/mol*KPHPMSHiraoka and Mori, 1989gas phase

(Ar+ • Carbon monoxide) + Carbon monoxide = (Ar+ • 2Carbon monoxide)

By formula: (Ar+ • CO) + CO = (Ar+ • 2CO)

Quantity Value Units Method Reference Comment
Δr3.kcal/molPIPECONorwood, Guo, et al., 1989gas phase; approximate value from Ar+(2P3/2) 2CO -> Ar+(2P3/2) + 2CO

Ar+ + Hydrogen = (Ar+ • Hydrogen)

By formula: Ar+ + H2 = (Ar+ • H2)

Quantity Value Units Method Reference Comment
Δr22.4kcal/molFAShul, Passarella, et al., 1987gas phase; switching reaction(Ar+)Ar, ΔrH>; Dehmer and Pratt, 1982

Ar+ + Nitrogen = (Ar+ • Nitrogen)

By formula: Ar+ + N2 = (Ar+ • N2)

Quantity Value Units Method Reference Comment
Δr39.2kcal/molFAShul, Passarella, et al., 1987gas phase; switching reaction(Ar+)Ar, ΔrH>; Dehmer and Pratt, 1982

Ar+ + Carbon monoxide = (Ar+ • Carbon monoxide)

By formula: Ar+ + CO = (Ar+ • CO)

Quantity Value Units Method Reference Comment
Δr18. ± 4.kcal/molPIPECONorwood, Guo, et al., 1989gas phase; Ar+(2P3/2)

Ar+ + helium = (Ar+ • helium)

By formula: Ar+ + He = (Ar+ • He)

Quantity Value Units Method Reference Comment
Δr0.60kcal/molEmSpecDehmer and Pratt, 1982gas phase

Ar+ + neon = (Ar+ • neon)

By formula: Ar+ + Ne = (Ar+ • Ne)

Quantity Value Units Method Reference Comment
Δr1.8kcal/molPIDehmer and Pratt, 1982gas phase

References

Chase, 1998
Chase, M.W., Jr., NIST-JANAF Themochemical Tables, Fourth Edition, J. Phys. Chem. Ref. Data, Monograph 9, 1998, 1-1951. [all data]