3-Isopropyl-2,5-piperazine-dione

Condensed phase thermochemistry data

Data compiled by: Hussein Y. Afeefy, Joel F. Liebman, and Stephen E. Stein

Quantity Value Units Method Reference Comment
Δcsolid-3966.6 ± 0.67kJ/molCcbPonomarev, Alekseeva, et al., 1963

References

Ponomarev, Alekseeva, et al., 1963
Ponomarev, V.V.; Alekseeva, T.A.; Akimova, L.N., Heats of combustion of valylphenylalanine, phenylalanylanhydride, and glycylvalylanhydride, Russ. J. Phys. Chem. (Engl. Transl.), 1963, 37, 117-118. [all data]