2-Methyl-4-methylene-1,3-dioxolane

Condensed phase thermochemistry data

Data compiled by: Hussein Y. Afeefy, Joel F. Liebman, and Stephen E. Stein

Quantity Value Units Method Reference Comment
Δfliquid-100.4 ± 1.3kcal/molCcbPihlaja and Heikkila, 1969
Quantity Value Units Method Reference Comment
Δcliquid-643.1 ± 1.3kcal/molCcbPihlaja and Heikkila, 1969Corresponding Δfliquid = -100.43 kcal/mol (simple calculation by NIST; no Washburn corrections)

References

Pihlaja and Heikkila, 1969
Pihlaja, K.; Heikkila, J., Heats of formation of cyclic vinyl ethers, Suom. Kemistil. B, 1969, 42, 338-342. [all data]