1,3-Dioxole, 4-methyl-

Reaction thermochemistry data

Data compiled by: Hussein Y. Afeefy, Joel F. Liebman, and Stephen E. Stein

Individual Reactions

4-Methylene-1,3-dioxolane = 1,3-Dioxole, 4-methyl-

By formula: C4H6O2 = C4H6O2

Quantity Value Units Method Reference Comment
Δr1.1 ± 0.5kJ/molEqkTaskinen, 1974liquid phase; solvent: Dioxane; GLC

References

Taskinen, 1974
Taskinen, E., Thermodynamics of vinyl ethers. V. The relative stabilities of 4-methylene-1,3-dioxolane and 4-methyl-1,3-dioxole, J. Chem. Thermodyn., 1974, 6, 1021-1025. [all data]