3,5-Bis(trifluoromethyl)pyrazol

Phase change data

Data compiled by: William E. Acree, Jr., James S. Chickos

Enthalpy of sublimation

ΔsubH (kJ/mol) Temperature (K) Method Reference
69.0 ± 0.6266.MEElguero, Yranzo, et al., 1991

References

Elguero, Yranzo, et al., 1991
Elguero, Jose; Yranzo, Gloria I.; Laynez, Jose; Jimenez, Pilar; Menendez, Margarita; Catalan, Javier; De Paz, Jose Luis G.; Anvia, Frederick; Taft, Robert W., Effect of the replacement of a methyl by a trifluoromethyl group on the acid-base properties of pyrazoles, J. Org. Chem., 1991, 56, 12, 3942-3947, https://doi.org/10.1021/jo00012a030 . [all data]