Boron, tetraethylbis[μ-(1H-pyrazolato-N1:N2)]di-

Phase change data

Data compiled as indicated in comments:
TRC - Thermodynamics Research Center, NIST Boulder Laboratories, Chris Muzny director
AC - William E. Acree, Jr., James S. Chickos

Quantity Value Units Method Reference Comment
Tfus379.2KN/ADomanska, Serwatowski, et al., 1993Uncertainty assigned by TRC = 0.2 K; TRC

Enthalpy of fusion

ΔfusH (kJ/mol) Temperature (K) Method Reference Comment
3.22379.2DSCDomanska, Serwatowski, et al., 1993, 2AC

In addition to the Thermodynamics Research Center (TRC) data available from this site, much more physical and chemical property data is available from the following TRC products:

References

Domanska, Serwatowski, et al., 1993
Domanska, U.; Serwatowski, J.; Sporzynski, A.; Dabrowski, M., Solubilities of organoboron compounds in organic solvents. Part 1. Solid- liquid equilibria of some pyrazaboles + heptane or +2-propanol, Thermochim. Acta, 1993, 222, 279-90. [all data]

Domanska, Serwatowski, et al., 1993, 2
Domanska, U.; Serwatowski, J.; Sporzynski, A.; Da«807»browski, M., Solubilities of organoboron compounds in organic solvents, Thermochimica Acta, 1993, 222, 2, 279-290, https://doi.org/10.1016/0040-6031(93)80561-N . [all data]