Stannane, tributylchloro-

Phase change data

Data compiled as indicated in comments:
TRC - Thermodynamics Research Center, NIST Boulder Laboratories, Chris Muzny director
AC - William E. Acree, Jr., James S. Chickos

Quantity Value Units Method Reference Comment
Tfus260.KN/AUtschick, Bachmann, et al., 1974Uncertainty assigned by TRC = 0.1 K; TRC

Enthalpy of fusion

ΔfusH (kcal/mol) Temperature (K) Reference Comment
2.732260.2Utschick, Bachmann, et al., 1974AC

In addition to the Thermodynamics Research Center (TRC) data available from this site, much more physical and chemical property data is available from the following TRC products:

References

Utschick, Bachmann, et al., 1974
Utschick, H.; Bachmann, G.; Kapitza, H., Chem. Tech. (Leipzig), 1974, 26, 422. [all data]