1,1,4,4-Tetranitrocyclohexane

Phase change data

Data compiled by: William E. Acree, Jr., James S. Chickos

Enthalpy of fusion

ΔfusH (kJ/mol) Temperature (K) Reference Comment
108.8489.2Oxley, Smith, et al., 2001Experimental enthalpy is abnormally large—compound may be decomposing

References

Oxley, Smith, et al., 2001
Oxley, J.C.; Smith, J.L.; Zhang, J.; Bedford, C., A Comparison of the Thermal Decomposition of Nitramines and Difluoramines, J. Phys. Chem. A, 2001, 105, 3, 579-590, https://doi.org/10.1021/jp002516a . [all data]