Chloropyrazine

Kovats' RI, non-polar column, isothermal

View large format table.

Column type Active phase Temperature (C) I Reference Comment
PackedOV-101130.895.Osmialowski, Halkiewicz, et al., 1985Ar, Chromosorb W HP; Column length: 1. m

Normal alkane RI, non-polar column, isothermal

View large format table.

Column type Active phase Temperature (C) I Reference Comment
CapillaryOV-101130.895.Qi, Yang, et al., 2000

Normal alkane RI, non-polar column, temperature ramp

View large format table.

Column type Active phase I Reference Comment
CapillaryOV-101861.Mihara and Masuda, 1987N2, 2. K/min; Column length: 50. m; Column diameter: 0.22 mm; Tstart: 80. C; Tend: 200. C

Normal alkane RI, polar column, custom temperature program

View large format table.

Column type Active phase I Reference Comment
CapillaryCarbowax 20M1351.Mihara and Masuda, 1987Program: not specified

Phase change data

Data compiled as indicated in comments:
BS - Robert L. Brown and Stephen E. Stein
AC - William E. Acree, Jr., James S. Chickos

Quantity Value Units Method Reference Comment
Tboil426.7KN/AAldrich Chemical Company Inc., 1990BS
Quantity Value Units Method Reference Comment
Δvap45.1 ± 1.5kJ/molCMorais, Miranda, et al., 2004AC

References

Osmialowski, Halkiewicz, et al., 1985
Osmialowski, K.; Halkiewicz, J.; Radecki, A.; Kaliszan, R., Quantum chemical parameters in correlation analysis of gas-liquid chromatographic retention indices of amines, J. Chromatogr., 1985, 346, 53-60, https://doi.org/10.1016/S0021-9673(00)90493-X . [all data]

Qi, Yang, et al., 2000
Qi, Y.; Yang, J.; Xu, L., correlation analysis of the structures and gas liquid chromatographic retention indices of amines, Chin. J. Anal. Chem., 2000, 28, 2, 223-227. [all data]

Mihara and Masuda, 1987
Mihara, S.; Masuda, H., Correlation between molecular structures and retention indices of pyrazines, J. Chromatogr., 1987, 402, 309-317, https://doi.org/10.1016/0021-9673(87)80029-8 . [all data]