Disilane, hexaphenyl-

Gas phase ion energetics data

Data compiled by: Sharon G. Lias, Rhoda D. Levin, and Sherif A. Kafafi

Ionization energy determinations

IE (eV) Method Reference
8.16 ± 0.15EIGaidis, Briggs, et al., 1971

Appearance energy determinations

Ion AE (eV) Other Products MethodReferenceComment
C18H15Si+9.61 ± 0.09(C6H5)3SiEIGaidis, Briggs, et al., 1971

References

Gaidis, Briggs, et al., 1971
Gaidis, J.M.; Briggs, P.R.; Shannon, T.W., Mass spectra of disilanes. Phenyl-silicon interaction and silicon-silicon bond strength, J. Phys. Chem., 1971, 75, 974. [all data]