1,4-Dioxo-1,2,3,4-tetrahydrophthalazine

Phase change data

Data compiled by: William E. Acree, Jr., James S. Chickos

Quantity Value Units Method Reference Comment
Δsub33.4 ± 0.2kcal/molMERibeiro da Silva and Cabral, 2008Based on data from 428. - 450. K.

Enthalpy of sublimation

ΔsubH (kcal/mol) Temperature (K) Method Reference Comment
31.7 ± 0.2439.MERibeiro da Silva and Cabral, 2008Based on data from 428. - 450. K.

References

Ribeiro da Silva and Cabral, 2008
Ribeiro da Silva, Manuel A.V.; Cabral, Joana I.T.A., Experimental study on the thermochemistry of 1-(2H)-phthalazinone and phthalhydrazide, The Journal of Chemical Thermodynamics, 2008, 40, 5, 829-835, https://doi.org/10.1016/j.jct.2008.01.010 . [all data]