Naphthalene,decahydro-2-methyl-(2α,4aα,8aβ

Gas phase ion energetics data

Data compiled by: Sharon G. Lias, Rhoda D. Levin, and Sherif A. Kafafi

Ionization energy determinations

IE (eV) Method Reference
9.32 ± 0.006EIZaikin, Musaev, et al., 1978

Appearance energy determinations

Ion AE (eV) Other Products MethodReferenceComment
C10H17+10.34 ± 0.006CH3EIZaikin, Musaev, et al., 1978

References

Zaikin, Musaev, et al., 1978
Zaikin, V.G.; Musaev, I.A.; Kurashova, E.K., Ionization and appearance potentials in organic chemistry, Org. Mass Spectrom., 1978, 13, 685. [all data]