2,5-Piperazinedione, 3,6-bis(2-methylpropyl)-

Condensed phase thermochemistry data

Data compiled by: Hussein Y. Afeefy, Joel F. Liebman, and Stephen E. Stein

Quantity Value Units Method Reference Comment
Δcsolid-7231.2kJ/molCcbFischer and Wrede, 1904Heat of combustion corrected for pressure
Δcsolid-7239.9kJ/molCcbLemoult, 1904

References

Fischer and Wrede, 1904
Fischer, E.; Wrede, F., Uber die Verbrennungswarme einiger organischer Verbindungen, Sitzungsber. Dtsch. Akad. Wiss. Berlin Kl. Math. Phys. Tech., 1904, 687-715. [all data]

Lemoult, 1904
Lemoult, M.P., Remarques sur une serie recenie de determinations calorimetriques, Compt. Rend., 1904, 663-635. [all data]