Benzoic acid, 4-amino-, octyl ester

Normal alkane RI, non-polar column, isothermal

View large format table.

Column type Active phase Temperature (C) I Reference Comment
CapillaryJXR180.2144.von Buchi, Lorini, et al., 1972
CapillaryJXR200.2153.von Buchi, Lorini, et al., 1972

References

von Buchi, Lorini, et al., 1972
von Buchi, J.; Lorini, V.; Perlia, X., Gaschromatographische Untersuchung einiger homologer Reihen von Lokalanaesthetica, Pharm. Acta Helv., 1972, 47, 65, 377-393. [all data]