Hexanoic acid, TMS derivative

Van Den Dool and Kratz RI, non-polar column, temperature ramp

View large format table.

Column type Active phase I Reference Comment
CapillarySE-521074.Lefevere, Verhaeghe, et al., 198925. m/0.32 mm/0.52 μm, He, 5. K/min; Tstart: 70. C; Tend: 270. C
CapillaryCP Sil 5 CB1063.Wurth, Kumps, et al., 1989N2, 60. C @ 0.5 min, 6. K/min, 280. C @ 5. min
CapillarySE-521074.Lefevere, Verhaeghe, et al., 198825. m/0.20 mm/0.40 μm, He, 5. K/min; Tstart: 50. C; Tend: 270. C
PackedOV-11063.Tanaka, Hine, et al., 1980N2, 100-120 mesh, 70. C @ 0.5 min, 28. K/min; Column length: 1.8 m; Tend: 290. C

Van Den Dool and Kratz RI, non-polar column, custom temperature program

View large format table.

Column type Active phase I Reference Comment
CapillaryMethyl Silicone1071.Geissler, Kawana, et al., 2007Program: not specified
CapillaryVF-5MS1068.6Tret'yakov, 200730. m/0.25 mm/0.25 μm, He; Program: Multi-step temperature program; T(initial)=60C; T(final)=270C
CapillaryVF-5MS1073.3Tret'yakov, 200730. m/0.25 mm/0.25 μm, He; Program: Multi-step temperature program; T(initial)=60C; T(final)=270C
CapillaryMethyl Silicone1071.Peng, Yang, et al., 1991Program: not specified
CapillaryDB-11069.Tsai, Oliphant, et al., 1985He; Program: not specified
PackedOV-1011063.Tanaka and Hine, 1982Program: not specified

Van Den Dool and Kratz RI, polar column, temperature ramp

View large format table.

Column type Active phase I Reference Comment
PackedCarbowax 20M1200.Peng, Yang, et al., 1991Supelcoport, 40. C @ 4. min, 8. K/min; Column length: 3.05 m; Tend: 200. C

Normal alkane RI, non-polar column, temperature ramp

View large format table.

Column type Active phase I Reference Comment
CapillaryHP-51073.Isidorov, Lech, et al., 200830. m/0.25 mm/0.25 μm, Helium, 3. K/min, 300. C @ 30. min; Tstart: 50. C
CapillaryHP-51074.Isidorov, Olchowik, et al., 200730. m/0.25 mm/0.25 μm, He, 5. K/min; Tstart: 50. C; Tend: 300. C
CapillaryHP-51074.Isidorov, Kotowska, et al., 200530. m/0.25 mm/0.25 μm, He; Tstart: 50. C; Tend: 300. C
CapillaryHP-51074.Isidorov, Kotowska, et al., 200530. m/0.25 mm/0.25 μm, He, 5. K/min; Tstart: 50. C; Tend: 300. C

Normal alkane RI, non-polar column, custom temperature program

View large format table.

Column type Active phase I Reference Comment
CapillaryHP-51074.Isidorov, Lech, et al., 200830. m/0.25 mm/0.25 μm, Helium; Program: not specified
CapillaryDB-51071.Kawana, Nakagawa, et al., 200830. m/0.25 mm/0.25 μm; Program: Total analysis run time was optimized to be 15 min
CapillaryRTx-5 Sil MS1064.Birkemeier and Kopka, 200730. m/0.25 mm/0.25 μm, Helium; Program: 70 0C (1 min) 1 0C/min -> 76 0C 6.09 0C/min -> 350 0C (1 min) -> 330 0C (10 min)

References

Lefevere, Verhaeghe, et al., 1989
Lefevere, M.F.; Verhaeghe, B.J.; Declerck, D.H.; Van Bocxlaer, J.F.; De Leenheer, A.P.; De Sagher, R.M., Metabolic Profiling of Urinary Organic Acids by Single and Multicolumn Capillary Gas Chromatography, J. Chromatogr. Sci., 1989, 27, 1, 23-29, https://doi.org/10.1093/chromsci/27.1.23 . [all data]

Wurth, Kumps, et al., 1989
Wurth, C.; Kumps, A.; Mardens, Y., Urinary organic acids: Retention indices on two capillary gas chromatography columns, J. Chromatogr., 1989, 491, 186-192, https://doi.org/10.1016/S0378-4347(00)82831-5 . [all data]

Lefevere, Verhaeghe, et al., 1988
Lefevere, M.F.; Verhaeghe, B.J.; Declerck, D.M.; de Leenheer, A.P., Automated profiling of urinary organic acids by dual-column gas chromatography and gas chromatography/mass spectrometry, Biomed. Environ. Mass Spectrom., 1988, 15, 6, 311-322, https://doi.org/10.1002/bms.1200150603 . [all data]

Tanaka, Hine, et al., 1980
Tanaka, K.; Hine, D.G.; West-Dull, A.; Lynn, T.B., Gas-chromatographic method of analysis for urinary organic acids. I. Retention indices of 155 metabolically important compounds, Clin. Chem., 1980, 26, 13, 1839-1846. [all data]

Geissler, Kawana, et al., 2007
Geissler, M.; Kawana, S.; Nakagawa, K., Analysis of urine organic acids using linear retention indices for the determination of metabolic disorders, LC-GC Europe, 2007, 26-27, retrieved from http://licance.icopyright.net/user/viewFreeUse.act?fuid=NjA1MTI0NQ%3D%3D. [all data]

Tret'yakov, 2007
Tret'yakov, K.V., Retention Data. NIST Mass Spectrometry Data Center., NIST Mass Spectrometry Data Center, 2007. [all data]

Peng, Yang, et al., 1991
Peng, C.T.; Yang, Z.C.; Maltby, D., Prediction of retention indexes. III. Silylated derivatives of polar compounds, J. Chromatogr., 1991, 586, 1, 113-129, https://doi.org/10.1016/0021-9673(91)80029-G . [all data]

Tsai, Oliphant, et al., 1985
Tsai, M.Y.; Oliphant, C.; Josephson, M.W., Identification of Metabolites Diagnostic for Organic Acidurias by Simultaneous Dual-Column Capillary Gas Chromatography, J. Chromatogr., 1985, 341, 1-10, https://doi.org/10.1016/S0378-4347(00)84004-9 . [all data]

Tanaka and Hine, 1982
Tanaka, K.; Hine, D.G., Compilation of Gas Chromatographic Retention Indices of 163 Metabolically Important Organic Acids, and Their Use in Detection of Patients with Organic Acidurias, J. Chromatogr., 1982, 239, 301-322, https://doi.org/10.1016/S0021-9673(00)81990-1 . [all data]

Isidorov, Lech, et al., 2008
Isidorov, V.A.; Lech, P.; Zolciak, A.; Rusak, N.; Szczepaniak, L., Gas Chromatographic - nass spectrometric investigation of metabolites from the needles and roots of pine seedlings at early stages of pathogenic fungi Armillaria ostoyae attack, Trees, 2008, 22, 4, 531-542, https://doi.org/10.1007/s00468-008-0213-z . [all data]

Isidorov, Olchowik, et al., 2007
Isidorov, V.A.; Olchowik, E.; Vinogorova, V.T., Simplified extraction procedure and gas chromatographic determination of acid compounds in plant material, Chemia Analityczna, 2007, 52, 3, 423-433. [all data]

Isidorov, Kotowska, et al., 2005
Isidorov, V.A.; Kotowska, U.; Vinogorova, V.T., GC Identification of organic compounds based on partition coefficients of their TMS derivatives in a hexane-acetonitrile system and retention indices, Anal. Sci., 2005, 21, 12, 1483-1489, https://doi.org/10.2116/analsci.21.1483 . [all data]

Kawana, Nakagawa, et al., 2008
Kawana, S.; Nakagawa, K.; Hesegawa, Y.; Kobayashi, H.; Yamaguchi, S., Improvement of sample throghput using gas chromatography-mass spectrometry for biochemical diagnosis of organic acid disorders, Clin. Chim. Acta, 2008, 392, 1-2, 34-40, https://doi.org/10.1016/j.cca.2008.02.025 . [all data]

Birkemeier and Kopka, 2007
Birkemeier, C.; Kopka, J., Design of metabolite recovery by variations of the metabolite profiling protocol in Concepts in Plant Metabolomics, Nikolau, B.J.; Wurtele, E.S., ed(s)., Springer, Dordrecht, Netheralnds, 2007, 45-69. [all data]