2-Hydroxymethyl-2-methyl-1,3-propanediol tetrahydrate

Phase change data

Data compiled by: Eugene S. Domalski and Elizabeth D. Hearing

Enthalpy of fusion

ΔfusH (kJ/mol) Temperature (K) Reference Comment
35.559302.95Laugt, Teisseire, et al., 1991

References

Laugt, Teisseire, et al., 1991
Laugt, M.; Teisseire, M.; Guion, J., Crystal data and solid-liquid transformation study by DSC of 2-hydroxmethyl-2-methyl-1,3-propanediol tetrahydrate, Powder Diffr., 1991, 6(4), 190-193. [all data]