Arabinitol, 5TMS derivative

Kovats' RI, non-polar column, isothermal

Data compiled by: NIST Mass Spectrometry Data Center, William E. Wallace, director

Column type Capillary
Active phase OV-101
Column length (m) 50.
Carrier gas
Substrate
Column diameter (mm)
Phase thickness (μm)
Temperature (C) 200.
I 1758.7
ReferenceAdam, 1981
Comment MSDC-RI

References

Adam, 1981
Adam, S., Separation of mono- and di-saccharide derivatives by high-resolution gas chromatography, Z. Lebensm. Unters. Forsch., 1981, 173, 2, 109-112, https://doi.org/10.1007/BF01042273 . [all data]