2,6-Pyridinediamine

Condensed phase thermochemistry data

Data compiled by: Hussein Y. Afeefy, Joel F. Liebman, and Stephen E. Stein

Quantity Value Units Method Reference Comment
Δcsolid-2961.4 ± 0.46kJ/molCcbYoung, Keith, et al., 1956Reanalyzed by Cox and Pilcher, 1970, Original value = -2962.7 ± 0.46 kJ/mol; see McClaine, 1947

Kovats' RI, non-polar column, isothermal

View large format table.

Column type Active phase Temperature (C) I Reference Comment
CapillaryOV-101150.1377.Terenina, Zhuravieva, et al., 199750. m/0.3 mm/0.4 μm, He

References

Young, Keith, et al., 1956
Young, J.A.; Keith, J.E.; Stehle, P.; Dzombak, W.C.; Hunt, H., Heats of combustion of some organic nitrogen compounds, Ind. Eng. Chem., 1956, 48, 1375-1378. [all data]

Cox and Pilcher, 1970
Cox, J.D.; Pilcher, G., Thermochemistry of Organic and Organometallic Compounds, Academic Press, New York, 1970, 1-636. [all data]

McClaine, 1947
McClaine, L.A., Thermodynamic data for some compounds containing carbon, hydrogen and oxygen, Ph.D. Thesis for Stanford University, 1947, 1-57. [all data]