Dihydroheptachlor

Normal alkane RI, non-polar column, temperature ramp

Data compiled by: NIST Mass Spectrometry Data Center, William E. Wallace, director

Column type CapillaryCapillaryCapillaryCapillaryCapillary
Active phase HP-1HP-1HP-1HP-1HP-1
Column length (m) 30.30.30.30.30.
Carrier gas H2H2H2H2H2
Substrate
Column diameter (mm) 0.250.250.250.250.25
Phase thickness (μm)
Tstart (C) 50.50.50.50.50.
Tend (C) 320.320.320.320.320.
Heat rate (K/min) 3.3.3.3.3.
Initial hold (min) 1.1.1.1.1.
Final hold (min)
I 1956.81968.21972.71980.01991.9
ReferenceDearth and Hites, 1991Dearth and Hites, 1991Dearth and Hites, 1991Dearth and Hites, 1991Dearth and Hites, 1991
Comment MSDC-RI MSDC-RI MSDC-RI MSDC-RI MSDC-RI
Column type CapillaryCapillaryCapillaryCapillaryCapillary
Active phase HP-1HP-1HP-1HP-1HP-1
Column length (m) 30.30.30.30.30.
Carrier gas H2H2H2H2H2
Substrate
Column diameter (mm) 0.250.250.250.250.25
Phase thickness (μm)
Tstart (C) 50.50.50.50.50.
Tend (C) 320.320.320.320.320.
Heat rate (K/min) 3.3.3.3.3.
Initial hold (min) 1.1.1.1.1.
Final hold (min)
I 1998.52006.62018.72025.92029.8
ReferenceDearth and Hites, 1991Dearth and Hites, 1991Dearth and Hites, 1991Dearth and Hites, 1991Dearth and Hites, 1991
Comment MSDC-RI MSDC-RI MSDC-RI MSDC-RI MSDC-RI
Column type CapillaryCapillaryCapillaryCapillaryCapillary
Active phase DB-5DB-5DB-5DB-5DB-5
Column length (m) 30.30.30.30.30.
Carrier gas H2H2H2H2H2
Substrate
Column diameter (mm) 0.250.250.250.250.25
Phase thickness (μm)
Tstart (C) 50.50.50.50.50.
Tend (C) 320.320.320.320.320.
Heat rate (K/min) 3.3.3.3.3.
Initial hold (min) 1.1.1.1.1.
Final hold (min)
I 1973.51993.42017.92029.02037.9
ReferenceDearth and Hites, 1991Dearth and Hites, 1991Dearth and Hites, 1991Dearth and Hites, 1991Dearth and Hites, 1991
Comment MSDC-RI MSDC-RI MSDC-RI MSDC-RI MSDC-RI
Column type Capillary
Active phase DB-5
Column length (m) 30.
Carrier gas H2
Substrate
Column diameter (mm) 0.25
Phase thickness (μm)
Tstart (C) 50.
Tend (C) 320.
Heat rate (K/min) 3.
Initial hold (min) 1.
Final hold (min)
I 2044.7
ReferenceDearth and Hites, 1991
Comment MSDC-RI

References

Dearth and Hites, 1991
Dearth, M.A.; Hites, R.A., Complete analysis of technical chlordane using negative ionization mass spectrometry, Environ. Sci. Technol., 1991, 25, 2, 245-254, https://doi.org/10.1021/es00014a005 . [all data]