Nickel, [[2,2'-[1,2-ethanediylbis(nitrilomethylidyne)]bis[phenolato]](2-)-N,N',O,O']-, (SP-4-2)-

Gas phase ion energetics data

Data compiled as indicated in comments:
LLK - Sharon G. Lias, Rhoda D. Levin, and Sherif A. Kafafi
B - John E. Bartmess

Electron affinity determinations

EA (eV) Method Reference Comment
1.06 ± 0.10IMREChen, Pan, et al., 1991SALEN:bis(salicylaldehyde[O-])dioxime of diaminoethane. (0.05eV > PhNO2); B

Ionization energy determinations

IE (eV) Method Reference Comment
7.57 ± 0.09EIGilbert, Taylor, et al., 1973LLK

References

Chen, Pan, et al., 1991
Chen, H.L.; Pan, Y.H.; Groh, S.; Hagan, T.E.; Ridge, D.P., Gas-Phase Charge-Transfer Reactions and Electron Affinities of Macrocyclic, Anionic Nickel Complexes - Ni(SALEN), Ni(Tetraphenylporphyrin), and Derivatives., J. Am. Chem. Soc., 1991, 113, 7, 2766, https://doi.org/10.1021/ja00007a068 . [all data]

Gilbert, Taylor, et al., 1973
Gilbert, W.C.; Taylor, L.T.; Dillard, J.G., Mass spectrometric study of polydentate Schiff base coordination compounds. I. Cobalt(II), nickel(II), and copper(II) complexes of salen and oaben, J. Am. Chem. Soc., 1973, 95, 2477. [all data]