9-Octadecenoic acid, 12-hydroxy-, methyl ester, [R-(Z)]-

Phase change data

Data compiled by: William E. Acree, Jr., James S. Chickos

Enthalpy of vaporization

ΔvapH (kJ/mol) Temperature (K) Method Reference Comment
89.3498.GCHusain, Sarma, et al., 1993Based on data from 453. - 543. K.

References

Husain, Sarma, et al., 1993
Husain, Sajid; Sarma, P. Nageswara; Swamy, G.Y.S.K.; Devi, K. Sita, Determination of physicochemical properties of some fatty acid methyl esters by gas liquid chromatography, J Am Oil Chem Soc, 1993, 70, 2, 149-155, https://doi.org/10.1007/BF02542618 . [all data]