(E) 1,2-Di(ethylthio)ethene

Reaction thermochemistry data

Data compiled by: Hussein Y. Afeefy, Joel F. Liebman, and Stephen E. Stein

Individual Reactions

(E) 1,2-Di(ethylthio)ethene = Ethene, 1,2-bis(ethylthio)-, (Z)-

By formula: C6H12S2 = C6H12S2

Quantity Value Units Method Reference Comment
Δr-2.9 ± 0.2kJ/molEqkVirtanen, 1986liquid phase; solvent: THF; NMR

References

Virtanen, 1986
Virtanen, R., Structure-stability relationships in vinyl sulfides. I. On the stable conformations of vinyl sulfides, Acta Chem. Scand., 1986, 40, 313-327. [all data]