1-Methyl-4-(1-propynyl-sulphonyl)benzene

Phase change data

Data compiled by: Hussein Y. Afeefy, Joel F. Liebman, and Stephen E. Stein

Quantity Value Units Method Reference Comment
Δsub103. ± 3.kJ/molVMackle and Steele, 1969Heat of combustion corrected for pressure

References

Mackle and Steele, 1969
Mackle, H.; Steele, W.V., Studies in thermochemistry of sulphones Part 12.-Heats of combustion and formation of some aryl-propargyl and propadiene sulphones, Trans. Faraday Soc., 1969, 65, 2073-2077. [all data]