ytterbium dichloride

Ion clustering data

Data compiled by: John E. Bartmess

Clustering reactions

Chlorine anion + Cl2Yb = (Chlorine anion • Cl2Yb)

By formula: Cl- + Cl2Yb = (Cl- • Cl2Yb)

Quantity Value Units Method Reference Comment
Δr>236.0kJ/molN/AKuznetsov, Kudin, et al., 1997gas phase; value altered from reference due to conversion from electron convention to ion convention

References

Kuznetsov, Kudin, et al., 1997
Kuznetsov, A.Yu.; Kudin, L.S.; Pogrebnoi, A.M.; Butman, M.F.; Burdukovskaya, G.G., A Mass-spectrometric Study of the Neutral and Ionic Components of Ytterbium Chloride Vapor: The Enthalpies of Formation of YbCl2 and YbCl3 Molecules and YbCl3- and YbCl4- Ion in the Gas Phas, Russ. J. Phys. Chem., 1997, 71, 216. [all data]