Thioboric acid

Gas phase ion energetics data

Data compiled by: Henry M. Rosenstock, Keith Draxl, Bruce W. Steiner, and John T. Herron

Ionization energy determinations

IE (eV) Method Reference
9.9 ± 0.3EIEdwards, Wiedemeier, et al., 1966

References

Edwards, Wiedemeier, et al., 1966
Edwards, J.G.; Wiedemeier, H.; Gilles, P.W., High molecular weight boron sulfides. Ill. A mass spectrometric study of the vaporization and decomposition of metathioboric acid, J. Am. Chem. Soc., 1966, 88, 2935. [all data]